Target
B2 bradykinin receptor
Ligand
BDBM50146116
Substrate
Meas. Tech.
ChEMBL_40293 (CHEMBL653425)
IC50
4.2±n/a nM
Citation
 Sawada, YKayakiri, HAbe, YMizutani, TInamura, NAsano, MAramori, IHatori, COku, TTanaka, H A new class of nonpeptide bradykinin B(2) receptor ligand, incorporating a 4-aminoquinoline framework. Identification of a key pharmacophore to determine species difference and agonist/antagonist profile. J Med Chem 47:2667-77 (2004)  
Target
Name:
B2 bradykinin receptor
Synonyms:
B2 BRADYKININ B2R BK-2 receptor BKRB2_HUMAN | Bradykinin B2 receptor
Type:
Enzyme Catalytic Domain
Mol. Mass.:
44467.17
Organism:
Homo sapiens (Human)
Description:
B2 BRADYKININ BDKRB2 HUMAN::P30411
Residue:
391
  
Inhibitor
Name:
BDBM50146116
Synonyms:
(E)-3-(6-Acetylamino-pyridin-3-yl)-N-({[2,4-dichloro-3-(4-dimethylamino-2-methyl-quinolin-8-yloxymethyl)-phenyl]-methyl-carbamoyl}-methyl)-acrylamide; Trihydrochloride | CHEMBL554127
Type:
Small organic molecule
Emp. Form.:
C32H32Cl2N6O4
Mol. Mass.:
635.54
SMILES:
CN(C)c1cc(C)nc2c(OCc3c(Cl)ccc(N(C)C(=O)CNC(=O)\C=C\c4ccc(NC(C)=O)nc4)c3Cl)cccc12
: