Target
Acetylcholinesterase
Ligand
BDBM50037176
Substrate
Meas. Tech.
ChEMBL_27798 (CHEMBL636508)
Ki
18±n/a nM
Citation
 Meier, CDucho, CGörbig, UEsnouf, RBalzarini, J Interaction of cycloSal-pronucleotides with cholinesterases from different origins. A structure-activity relationship. J Med Chem 47:2839-52 (2004)  
Target
Name:
Acetylcholinesterase
Synonyms:
3.1.1.7 Acetylcholinesterase (AChE) ache
Type:
Mol. Mass.:
65900.74
Organism:
Tetronarce californica (Pacific electric ray) (Torpedo californica)
Description:
P04058
Residue:
586
  
Inhibitor
Name:
BDBM50037176
Synonyms:
(2S)-2-[(1-benzylpiperidin-4-yl)methyl]-5,6-dimethoxyindan-1-one CHEMBL108726 | DONEPEZIL
Type:
Small organic molecule
Emp. Form.:
C24H29NO3
Mol. Mass.:
379.492
SMILES:
COc1cc2C[C@H](CC3CCN(Cc4ccccc4)CC3)C(=O)c2cc1OC
: