Target
Proto-oncogene tyrosine-protein kinase Src
Ligand
BDBM50370347
Substrate
Meas. Tech.
ChEMBL_217006 (CHEMBL821541)
IC50
12100±n/a nM
Citation
 Nam, NHYe, GSun, GParang, K Conformationally constrained peptide analogues of pTyr-Glu-Glu-Ile as inhibitors of the Src SH2 domain binding. J Med Chem 47:3131-41 (2004)  
Target
Name:
Proto-oncogene tyrosine-protein kinase Src
Synonyms:
Calmodulin/Proto-oncogene tyrosine-protein kinase Src Proto-oncogene c-Src SRC SRC_HUMAN V-src sarcoma (Schmidt-Ruppin A-2) viral oncogene homolog (avian) p60-Src | pp60c-src
Type:
Protein
Mol. Mass.:
59838.60
Organism:
Homo sapiens (Human)
Description:
P12931
Residue:
536
  
Inhibitor
Name:
BDBM50370347
Synonyms:
CHEMBL1790814
Type:
Small organic molecule
Emp. Form.:
C24H33N4O12P
Mol. Mass.:
600.5122
SMILES:
CC[C@@H](C)[C@H](NC(=O)[C@H](CCC(O)=O)NC(=O)C[C@@H]1NC(=O)[C@H](Cc2ccc(OP(O)(O)=O)cc2)NC1=O)C(O)=O
: