Target
Adenosine deaminase
Ligand
BDBM22919
Substrate
Meas. Tech.
ChEMBL_31106 (CHEMBL640462)
Ki
680±n/a nM
Citation
 Erlanson, DAMcDowell, RSO'Brien, T Fragment-based drug discovery. J Med Chem 47:3463-82 (2004)  
Target
Name:
Adenosine deaminase
Synonyms:
ADA ADA_HUMAN | Adenosine aminohydrolase
Type:
Enzyme
Mol. Mass.:
40759.44
Organism:
Homo sapiens (Human)
Description:
Human recombinant ADA was expressed and purified from an ADA-deficient bacterial strain.
Residue:
363
  
Inhibitor
Name:
BDBM22919
Synonyms:
1-[1-hydroxy-4-(naphthalen-1-yl)butan-2-yl]-1H-imidazole-4-carboxamide FR230513 | imidazole-4-carboxamide derivative, 3
Type:
Small organic molecule
Emp. Form.:
C18H19N3O2
Mol. Mass.:
309.3624
SMILES:
NC(=O)c1cn(cn1)C(CO)CCc1cccc2ccccc12
: