Target
Adenosine kinase
Ligand
BDBM50094702
Substrate
Meas. Tech.
ChEMBL_31134 (CHEMBL644802)
Kd
3000000±n/a nM
Citation
 Erlanson, DAMcDowell, RSO'Brien, T Fragment-based drug discovery. J Med Chem 47:3463-82 (2004)  
Target
Name:
Adenosine kinase
Synonyms:
ADK | ADK_HUMAN
Type:
PROTEIN
Mol. Mass.:
40545.97
Organism:
Homo sapiens (Human)
Description:
ChEMBL_1467841
Residue:
362
  
Inhibitor
Name:
BDBM50094702
Synonyms:
1H-indole Indol indole
Type:
Small organic molecule
Emp. Form.:
C8H7N
Mol. Mass.:
117.1479
SMILES:
c1cc2ccccc2[nH]1
: