Target
Glycogen phosphorylase, liver form
Ligand
BDBM50149237
Substrate
Meas. Tech.
ChEMBL_70994 (CHEMBL680570)
IC50
12500±n/a nM
Citation
 Erlanson, DAMcDowell, RSO'Brien, T Fragment-based drug discovery. J Med Chem 47:3463-82 (2004)  
Target
Name:
Glycogen phosphorylase, liver form
Synonyms:
Glycogen phosphorylase, liver form PYGL_MOUSE | Pygl
Type:
PROTEIN
Mol. Mass.:
97468.48
Organism:
Mus musculus
Description:
ChEMBL_70994
Residue:
850
  
Inhibitor
Name:
BDBM50149237
Synonyms:
5-Chloro-1H-indole-2-carboxylic acid (2-methoxy-ethyl)-amide CP-305,494
Type:
Small organic molecule
Emp. Form.:
C12H13ClN2O2
Mol. Mass.:
252.697
SMILES:
COCCNC(=O)c1cc2cc(Cl)ccc2[nH]1
: