Target
Tyrosine-protein phosphatase non-receptor type 1
Ligand
BDBM13952
Substrate
Meas. Tech.
ChEMBL_162587 (CHEMBL768528)
Kd
26000±n/a nM
Citation
 Erlanson, DAMcDowell, RSO'Brien, T Fragment-based drug discovery. J Med Chem 47:3463-82 (2004)  
Target
Name:
Tyrosine-protein phosphatase non-receptor type 1
Synonyms:
PTN1_HUMAN PTPN1 Protein tyrosine phosphatase-1B (PTP1B) Protein-tyrosine phosphatase 1B (PTP1B) Tyrosine-protein phosphatase non-receptor type 1 (PTP1B)
Type:
Protein phosphatase
Mol. Mass.:
49963.76
Organism:
Homo sapiens (Human)
Description:
Human recombinant GST-fusion PTP1B (1-435).
Residue:
435
  
Inhibitor
Name:
BDBM13952
Synonyms:
2-(Naphthalen-1-yloxalylamino)benzoic Acid CHEMBL64934 | naphthyloxamic acid 5
Type:
Small organic molecule
Emp. Form.:
C19H13NO5
Mol. Mass.:
335.3102
SMILES:
OC(=O)C(=O)N(c1ccccc1C(O)=O)c1cccc2ccccc12
: