Target
Glycogen phosphorylase, liver form
Ligand
BDBM50016703
Substrate
Meas. Tech.
ChEMBL_99044 (CHEMBL712597)
Ki
400±n/a nM
Citation
 Kristiansen, MAndersen, BIversen, LFWestergaard, N Identification, synthesis, and characterization of new glycogen phosphorylase inhibitors binding to the allosteric AMP site. J Med Chem 47:3537-45 (2004)  
Target
Name:
Glycogen phosphorylase, liver form
Synonyms:
Glycogen Phosphorylase (PYGL) Liver glycogen phosphorylase PYGL_HUMAN
Type:
Homodimer
Mol. Mass.:
97153.98
Organism:
Homo sapiens (Human)
Description:
Dimers associate into a tetramer to form the enzymatically active phosphorylase A.
Residue:
847
  
Inhibitor
Name:
BDBM50016703
Synonyms:
2-Hydroxymethyl-pyrrolidine-3,4-diol CHEMBL80254 | Imino-D-Arabinitol
Type:
Small organic molecule
Emp. Form.:
C5H11NO3
Mol. Mass.:
133.1457
SMILES:
OC[C@H]1NC[C@@H](O)[C@@H]1O
: