Target
Glycogen phosphorylase, muscle form
Ligand
BDBM50149303
Substrate
Meas. Tech.
ChEMBL_138361 (CHEMBL749048)
IC50
900±n/a nM
Citation
 Kristiansen, MAndersen, BIversen, LFWestergaard, N Identification, synthesis, and characterization of new glycogen phosphorylase inhibitors binding to the allosteric AMP site. J Med Chem 47:3537-45 (2004)  
Target
Name:
Glycogen phosphorylase, muscle form
Synonyms:
Glycogen phosphorylase, muscle form Myophosphorylase PYGM_HUMAN
Type:
PROTEIN
Mol. Mass.:
97097.45
Organism:
Homo sapiens (Human)
Description:
ChEMBL_1449751
Residue:
842
  
Inhibitor
Name:
BDBM50149303
Synonyms:
4-[2-(3-Nitro-benzoylamino)-phenoxy]-phthalic acid CHEMBL326611
Type:
Small organic molecule
Emp. Form.:
C21H14N2O8
Mol. Mass.:
422.3445
SMILES:
OC(=O)c1ccc(Oc2ccccc2NC(=O)c2cccc(c2)[N+]([O-])=O)cc1C(O)=O
: