Target
Adenosine receptor A2b
Ligand
BDBM50150075
Substrate
Meas. Tech.
ChEMBL_31079 (CHEMBL640610)
EC50
34±n/a nM
Citation
 Beukers, MWChang, LCvon Frijtag Drabbe Künzel, JKMulder-Krieger, TSpanjersberg, RFBrussee, JIJzerman, AP New, non-adenosine, high-potency agonists for the human adenosine A2B receptor with an improved selectivity profile compared to the reference agonist N-ethylcarboxamidoadenosine. J Med Chem 47:3707-9 (2004)  
Target
Name:
Adenosine receptor A2b
Synonyms:
AA2BR_HUMAN ADORA2B Adenosine receptors A2b | Adenosine receptors; A2a & A2b
Type:
G Protein-Coupled Receptor (GPCR)
Mol. Mass.:
36341.22
Organism:
Homo sapiens (Human)
Description:
Residue:
332
  
Inhibitor
Name:
BDBM50150075
Synonyms:
2-Amino-6-(1H-imidazol-2-ylmethylsulfanyl)-4-(3-methoxy-phenyl)-pyridine-3,5-dicarbonitrile | CHEMBL125979
Type:
Small organic molecule
Emp. Form.:
C18H14N6OS
Mol. Mass.:
362.408
SMILES:
COc1cccc(c1)-c1c(C#N)c(N)nc(SCc2ncc[nH]2)c1C#N
: