Target
Nitric oxide synthase, brain
Ligand
BDBM22030
Substrate
Meas. Tech.
ChEMBL_143520 (CHEMBL755133)
Ki
130±n/a nM
Citation
 Gómez-Vidal, JAMartásek, PRoman, LJSilverman, RB Potent and selective conformationally restricted neuronal nitric oxide synthase inhibitors. J Med Chem 47:703-10 (2004)  
Target
Name:
Nitric oxide synthase, brain
Synonyms:
Bnos NC-NOS NOS type I nNOS Neuronal nitric oxide synthase Nitric Oxide Synthase, brain Nitric oxide synthase, brain (nNOS) Nitric-oxide synthase, brain (nNOS) Nos1 | Peptidyl-cysteine S-nitrosylase NOS1
Type:
Enzyme
Mol. Mass.:
160570.98
Organism:
Rattus norvegicus (rat)
Description:
Recombinant nNOS overexpressed in E. coli was used in enzyme assays.
Residue:
1429
  
Inhibitor
Name:
BDBM22030
Synonyms:
(2S)-2-amino-N-[(1S)-3-amino-1-(aminocarbonyl)propyl]-5-{[(E)-imino(nitroamino)methyl]amino}pentanamide (2S)-2-amino-N-[(1S)-3-amino-1-(aminocarbonyl)propyl]-5-{[imino(nitroamino)methyl]amino}pentanamide CHEMBL1204421 CHEMBL481413 L-Arg NO2-L-Dbu-NH2 L-Nomega-nitroarginine-2,4-L-diaminobutyramide | dipeptide amide inhibitor I
Type:
Small organic molecule
Emp. Form.:
C10H22N8O4
Mol. Mass.:
318.3329
SMILES:
NCC[C@H](NC(=O)[C@@H](N)CCCN=C(N)N[N+]([O-])=O)C(N)=O
: