Target
Nitric oxide synthase, brain
Ligand
BDBM50063300
Substrate
Meas. Tech.
ChEMBL_143658 (CHEMBL755899)
IC50
35000±n/a nM
Citation
 Hallinan, EAHagen, TJBergmanis, AMoore, WMJerome, GMSpangler, DPStevens, AMShieh, HSManning, PTPitzele, BS 5-Fluorinated L-lysine analogues as selective induced nitric oxide synthase inhibitors. J Med Chem 47:900-6 (2004)  
Target
Name:
Nitric oxide synthase, brain
Synonyms:
Constitutive NOS NC-NOS NOS type I nNOS NOS1_HUMAN Neuronal nitric oxide synthase Nitric oxide synthase, neuronal (nNOS) bNOS | nNOS
Type:
Homodimer
Mol. Mass.:
160985.98
Organism:
Homo sapiens (Human)
Description:
P29475
Residue:
1434
  
Inhibitor
Name:
BDBM50063300
Synonyms:
(L-N6-1-iminoethyl)lysine 6-Acetimidoylamino-2-amino-hexanoic acid CHEMBL7889 N~6~-[(1Z)-ethanimidoyl]-L-lysine | l-NIL
Type:
Small organic molecule
Emp. Form.:
C8H17N3O2
Mol. Mass.:
187.2395
SMILES:
CC(N)=NCCCC[C@H](N)C(O)=O
: