Target
Nitric oxide synthase, inducible
Ligand
BDBM50139794
Substrate
Meas. Tech.
ChEMBL_89494 (CHEMBL696859)
IC50
21400±n/a nM
Citation
 Hallinan, EAHagen, TJBergmanis, AMoore, WMJerome, GMSpangler, DPStevens, AMShieh, HSManning, PTPitzele, BS 5-Fluorinated L-lysine analogues as selective induced nitric oxide synthase inhibitors. J Med Chem 47:900-6 (2004)  
Target
Name:
Nitric oxide synthase, inducible
Synonyms:
HEP-NOS Inducible NO synthase NOS type II NOS2A Nitric oxide synthase, inducible (iNOS) | iNOS
Type:
Homodimer
Mol. Mass.:
131141.95
Organism:
Homo sapiens (Human)
Description:
P35228
Residue:
1153
  
Inhibitor
Name:
BDBM50139794
Synonyms:
6-Acetimidoylamino-2-amino-5,5-difluoro-hexanoic acid; dihydrochloride | CHEMBL536253
Type:
Small organic molecule
Emp. Form.:
C8H15F2N3O2
Mol. Mass.:
223.2204
SMILES:
CC(=N)NCC(F)(F)CCC(N)C(O)=O
: