Target
Adenylate cyclase type 5
Ligand
BDBM50025883
Substrate
Meas. Tech.
ChEMBL_31714 (CHEMBL645374)
IC50
15000±n/a nM
Citation
 Ye, SRezende, MMDeng, WPHerbert, BDaly, JWJohnson, RAKirk, KL Synthesis of 2',5'-dideoxy-2-fluoroadenosine and 2',5'-dideoxy-2,5'-difluoroadenosine: potent P-site inhibitors of adenylyl cyclase. J Med Chem 47:1207-13 (2004)  
Target
Name:
Adenylate cyclase type 5
Synonyms:
ADCY5_RAT Adcy5 Adenylate cyclase type IX Adenylyl cyclase 5
Type:
PROTEIN
Mol. Mass.:
139188.88
Organism:
Rattus norvegicus
Description:
ChEMBL_31725
Residue:
1262
  
Inhibitor
Name:
BDBM50025883
Synonyms:
(2R,3S,5R)-5-(6-amino-9H-purin-9-yl)-2-(hydroxymethyl)tetrahydrofuran-3-ol 2'-Deoxyadenosine 2'deoxyadenosine CHEMBL416340 | DEOXYADENOSINE
Type:
Small organic molecule
Emp. Form.:
C10H13N5O3
Mol. Mass.:
251.2419
SMILES:
Nc1ncnc2n(cnc12)C1CC(O)C(CO)O1
: