Target
Adenosine receptor A1
Ligand
BDBM50140957
Substrate
Meas. Tech.
ChEMBL_27577 (CHEMBL643499)
Ki
>1000±n/a nM
Citation
 Baraldi, PGTabrizi, MAPreti, DBovero, ARomagnoli, RFruttarolo, FZaid, NAMoorman, ARVarani, KGessi, SMerighi, SBorea, PA Design, synthesis, and biological evaluation of new 8-heterocyclic xanthine derivatives as highly potent and selective human A2B adenosine receptor antagonists. J Med Chem 47:1434-47 (2004)  
Target
Name:
Adenosine receptor A1
Synonyms:
A1 adenosine receptor (hA1) AA1R_HUMAN ADORA1 Adenosine A1-receptor Adenosine receptor A1 (hA1) | Adenosine transporter (AdT)
Type:
G Protein-Coupled Receptor (GPCR)
Mol. Mass.:
36520.92
Organism:
Homo sapiens (Human)
Description:
P30542
Residue:
326
  
Inhibitor
Name:
BDBM50140957
Synonyms:
8-(5-{2-[4-(4-Fluoro-phenyl)-piperazin-1-yl]-2-oxo-ethoxy}-2-methyl-2H-pyrazol-3-yl)-1,3-dipropyl-3,7-dihydro-purine-2,6-dione | CHEMBL33930
Type:
Small organic molecule
Emp. Form.:
C27H33FN8O4
Mol. Mass.:
552.6005
SMILES:
CCCn1c2nc([nH]c2c(=O)n(CCC)c1=O)-c1cc(OCC(=O)N2CCN(CC2)c2ccc(F)cc2)nn1C
: