Target
Adenosine receptor A2b
Ligand
BDBM50140967
Substrate
Meas. Tech.
ChEMBL_30306 (CHEMBL636451)
Ki
12±n/a nM
Citation
 Baraldi, PGTabrizi, MAPreti, DBovero, ARomagnoli, RFruttarolo, FZaid, NAMoorman, ARVarani, KGessi, SMerighi, SBorea, PA Design, synthesis, and biological evaluation of new 8-heterocyclic xanthine derivatives as highly potent and selective human A2B adenosine receptor antagonists. J Med Chem 47:1434-47 (2004)  
Target
Name:
Adenosine receptor A2b
Synonyms:
AA2BR_HUMAN ADORA2B Adenosine receptors A2b | Adenosine receptors; A2a & A2b
Type:
G Protein-Coupled Receptor (GPCR)
Mol. Mass.:
36341.22
Organism:
Homo sapiens (Human)
Description:
Residue:
332
  
Inhibitor
Name:
BDBM50140967
Synonyms:
CHEMBL33305 | N-(3,4-Dimethoxy-phenyl)-2-[5-(2,6-dioxo-1,3-dipropyl-2,3,6,7-tetrahydro-1H-purin-8-yl)-1-methyl-1H-pyrazol-3-yloxy]-acetamide
Type:
Small organic molecule
Emp. Form.:
C25H31N7O6
Mol. Mass.:
525.5569
SMILES:
CCCn1c2nc([nH]c2c(=O)n(CCC)c1=O)-c1cc(OCC(=O)Nc2ccc(OC)c(OC)c2)nn1C
: