Target
Adenosine receptor A2b
Ligand
BDBM50140989
Substrate
Meas. Tech.
ChEMBL_30307 (CHEMBL638561)
Ki
34±n/a nM
Citation
 Baraldi, PGTabrizi, MAPreti, DBovero, ARomagnoli, RFruttarolo, FZaid, NAMoorman, ARVarani, KGessi, SMerighi, SBorea, PA Design, synthesis, and biological evaluation of new 8-heterocyclic xanthine derivatives as highly potent and selective human A2B adenosine receptor antagonists. J Med Chem 47:1434-47 (2004)  
Target
Name:
Adenosine receptor A2b
Synonyms:
AA2BR_HUMAN ADORA2B Adenosine receptors A2b | Adenosine receptors; A2a & A2b
Type:
G Protein-Coupled Receptor (GPCR)
Mol. Mass.:
36341.22
Organism:
Homo sapiens (Human)
Description:
Residue:
332
  
Inhibitor
Name:
BDBM50140989
Synonyms:
CHEMBL32281 | N-[5-(2,6-Dioxo-1,3-dipropyl-2,3,6,7-tetrahydro-1H-purin-8-yl)-2-methyl-2H-pyrazol-3-yl]-2-phenyl-acetamide
Type:
Small organic molecule
Emp. Form.:
C23H27N7O3
Mol. Mass.:
449.5056
SMILES:
CCCn1c2nc([nH]c2c(=O)n(CCC)c1=O)-c1cc(NC(=O)Cc2ccccc2)n(C)n1
: