Target
Adenosine receptor A1
Ligand
BDBM50140974
Substrate
Meas. Tech.
ChEMBL_27577 (CHEMBL643499)
Ki
72±n/a nM
Citation
 Baraldi, PGTabrizi, MAPreti, DBovero, ARomagnoli, RFruttarolo, FZaid, NAMoorman, ARVarani, KGessi, SMerighi, SBorea, PA Design, synthesis, and biological evaluation of new 8-heterocyclic xanthine derivatives as highly potent and selective human A2B adenosine receptor antagonists. J Med Chem 47:1434-47 (2004)  
Target
Name:
Adenosine receptor A1
Synonyms:
A1 adenosine receptor (hA1) AA1R_HUMAN ADORA1 Adenosine A1-receptor Adenosine receptor A1 (hA1) | Adenosine transporter (AdT)
Type:
G Protein-Coupled Receptor (GPCR)
Mol. Mass.:
36520.92
Organism:
Homo sapiens (Human)
Description:
P30542
Residue:
326
  
Inhibitor
Name:
BDBM50140974
Synonyms:
2-[5-(1,3-Diisobutyl-2,6-dioxo-2,3,6,7-tetrahydro-1H-purin-8-yl)-2-methyl-2H-pyrazol-3-yloxy]-N-(4-fluoro-phenyl)-acetamide | CHEMBL33591
Type:
Small organic molecule
Emp. Form.:
C25H30FN7O4
Mol. Mass.:
511.5486
SMILES:
CC(C)Cn1c2nc([nH]c2c(=O)n(CC(C)C)c1=O)-c1cc(OCC(=O)Nc2ccc(F)cc2)n(C)n1
: