Target
Fibroblast growth factor 1
Ligand
BDBM50422560
Substrate
Meas. Tech.
ChEMBL_70628 (CHEMBL678684)
Kd
130±n/a nM
Citation
 Bytheway, ICochran, S Validation of molecular docking calculations involving FGF-1 and FGF-2. J Med Chem 47:1683-93 (2004)  
Target
Name:
Fibroblast growth factor 1
Synonyms:
Acidic fibroblast growth factor ECGF-beta FGF1_HUMAN Fibroblast growth factor 1 (FGF-1) Heparin-binding growth factor 1 | aFGF
Type:
Protein
Mol. Mass.:
17461.01
Organism:
Homo sapiens (Human)
Description:
P05230
Residue:
155
  
Inhibitor
Name:
BDBM50422560
Synonyms:
CHEMBL2303817
Type:
Small organic molecule
Emp. Form.:
C12H22O34S8
Mol. Mass.:
966.803
SMILES:
OS(=O)(=O)C[C@@H]1[C@H](OS(O)(=O)=O)O[C@H](OS(O)(=O)=O)[C@H](O[C@H]2O[C@@H](COS(O)(=O)=O)[C@@H](OS(O)(=O)=O)[C@H](OS(O)(=O)=O)[C@H]2OS(O)(=O)=O)[C@H]1OS(O)(=O)=O
: