Target
Motilin receptor
Ligand
BDBM50143038
Substrate
Meas. Tech.
ChEMBL_122662 (CHEMBL732792)
Ki
2±n/a nM
Citation
 Li, JJChao, HGWang, HTino, JALawrence, RMEwing, WRMa, ZYan, MSlusarchyk, DSeethala, RSun, HLi, DBurford, NTStoffel, RHSalyan, MELi, CYWitkus, MZhao, NRich, AGordon, DA Discovery of a potent and novel motilin agonist. J Med Chem 47:1704-8 (2004)  
Target
Name:
Motilin receptor
Synonyms:
G-protein coupled receptor 38 MLNR MTLR1 | MTLR_HUMAN
Type:
PROTEIN
Mol. Mass.:
45365.95
Organism:
Homo sapiens (Human)
Description:
ChEMBL_122664
Residue:
412
  
Inhibitor
Name:
BDBM50143038
Synonyms:
8'N-[1-[1-carbamoyl-3-phenyl-(1S)-propylcarbamoyl]-3-phenyl-(1S)-propyl]-2'-benzo[d][1,3]dioxol-5-ylmethyl-1',3'-dioxospiro[hexahydropyridine-4,5'-(2',3',5',8'-tetrahydro-1'H-[1,2,4]triazolo[1,2-a]pyridazine)]-8'-carboxamide | CHEMBL296748
Type:
Small organic molecule
Emp. Form.:
C39H43N7O7
Mol. Mass.:
721.8014
SMILES:
NC(=O)[C@H](CCc1ccccc1)NC(=O)[C@H](CCc1ccccc1)NC(=O)C1C=CC2(CCNCC2)n2n1c(=O)n(Cc1ccc3OCOc3c1)c2=O
: