Target
Dimer of Protein farnesyltransferase subunit beta
Ligand
BDBM14014
Substrate
Meas. Tech.
ChEMBL_70572 (CHEMBL682705)
IC50
1.1±n/a nM
Citation
 Bell, IM Inhibitors of farnesyltransferase: a rational approach to cancer chemotherapy? J Med Chem 47:1869-78 (2004)  
Target
Name:
Dimer of Protein farnesyltransferase subunit beta
Synonyms:
Protein Farnesyltransferase (PFT) Chain B
Type:
Mol. Mass.:
Description:
ASSAY_ID of EBI is 51428
Components:
This complex has 3 components.
Component 1
Name:
Protein farnesyltransferase subunit beta
Synonyms:
CAAX farnesyltransferase subunit alpha FNTB FTase-alpha GGTase-I-alpha Protein farnesyl/geranylgeranyl transferase Protein farnesyltransferase subunit beta Protein farnesyltransferase/geranylgeranyltransferase type-1 subunit alpha Ras proteins prenyltransferase subunit beta | Type I protein geranyl-geranyltransferase subunit alpha
Type:
Enzyme Subunit
Mol. Mass.:
48766.02
Organism:
Homo sapiens (Human)
Description:
Protein farnesyltransferase subunit beta
Residue:
437
  
Component 2
Name:
Protein farnesyltransferase subunit beta
Synonyms:
CAAX farnesyltransferase subunit alpha FNTB FTase-alpha GGTase-I-alpha Protein farnesyl/geranylgeranyl transferase Protein farnesyltransferase subunit beta Protein farnesyltransferase/geranylgeranyltransferase type-1 subunit alpha Ras proteins prenyltransferase subunit beta | Type I protein geranyl-geranyltransferase subunit alpha
Type:
Enzyme Subunit
Mol. Mass.:
48766.02
Organism:
Homo sapiens (Human)
Description:
Protein farnesyltransferase subunit beta
Residue:
437
  
Inhibitor
Name:
BDBM14014
Synonyms:
(5S)-31-oxo-20-oxa-2,6,11,13-tetraazahexacyclo[19.6.2.1^{2,5}.1^{15,19}.0^{9,13}.0^{24,28}]hentriaconta-1(27),9,11,15,17,19(30),21(29),22,24(28),25-decaene-18-carbonitrile Macrocyclic 3-Aminopyrrolidinone analog 66
Type:
Small organic molecule
Emp. Form.:
C27H23N5O2
Mol. Mass.:
449.5038
SMILES:
O=C1[C@@H]2CCN1c1cccc3ccc(Oc4cc(Cn5cncc5CCN2)ccc4C#N)cc13
: