Target
Amine oxidase [flavin-containing] A
Ligand
BDBM50292163
Substrate
Meas. Tech.
ChEMBL_122784 (CHEMBL730892)
Ki
4±n/a nM
Citation
 Chimenti, FBolasco, AManna, FSecci, DChimenti, PBefani, OTurini, PGiovannini, VMondovì, BCirilli, RLa Torre, F Synthesis and selective inhibitory activity of 1-acetyl-3,5-diphenyl-4,5-dihydro-(1H)-pyrazole derivatives against monoamine oxidase. J Med Chem 47:2071-4 (2004)  
Target
Name:
Amine oxidase [flavin-containing] A
Synonyms:
AOFA_HUMAN MAO-A Monoamine oxidase Monoamine oxidase type A (MAO A) Monoamine oxidase type A (MAOA)
Type:
Protein
Mol. Mass.:
59689.53
Organism:
Homo sapiens (Human)
Description:
P21397
Residue:
527
  
Inhibitor
Name:
BDBM50292163
Synonyms:
1-[3-(2,4-Dihydroxy-phenyl)-5-(2-methoxy-phenyl)-4,5-dihydro-pyrazol-1-yl]-ethanone | CHEMBL303112
Type:
Small organic molecule
Emp. Form.:
C18H18N2O4
Mol. Mass.:
326.3465
SMILES:
COc1ccccc1C1CC(=NN1C(C)=O)c1ccc(O)cc1O
: