Target
Vasopressin V1a receptor
Ligand
BDBM50145111
Substrate
Meas. Tech.
ChEMBL_214414 (CHEMBL820278)
Ki
2.9±n/a nM
Citation
 Cheng, LLStoev, SManning, MDerick, SPena, AMimoun, MBGuillon, G Design of potent and selective agonists for the human vasopressin V1b receptor based on modifications of [deamino-cys1]arginine vasopressin at position 4. J Med Chem 47:2375-88 (2004)  
Target
Name:
Vasopressin V1a receptor
Synonyms:
AVPR V1a AVPR1A V1AR_HUMAN VASOPRESSIN V1A Vasopressin V1 receptor Vasopressin receptor
Type:
Receptor
Mol. Mass.:
46820.18
Organism:
Homo sapiens (Human)
Description:
P37288
Residue:
418
  
Inhibitor
Name:
BDBM50145111
Synonyms:
(2S)-2-{[(2R)-1-{[(4S,7R,13R,16S)-13-benzyl-7-(carbamoylmethyl)-10-(1-hydroxyethyl)-16-[(4-hydroxyphenyl)methyl]-6,9,12,15,18-pentaoxo-1,2-dithia-5,8,11,14,17-pentaazacycloicosan-4-yl]carbonyl}pyrrolidin-2-yl]formamido}-N-(carbamoylmethyl)-5-[(diaminomethylidene)amino]pentanamide | CHEMBL405783
Type:
Small organic molecule
Emp. Form.:
C45H63N13O12S2
Mol. Mass.:
1042.192
SMILES:
CC(O)C1NC(=O)[C@@H](Cc2ccccc2)NC(=O)[C@H](Cc2ccc(O)cc2)NC(=O)CCSSC[C@@H](NC(=O)[C@@H](CC(N)=O)NC1=O)C(=O)N1CCC[C@@H]1C(=O)N[C@@H](CCCNC(N)=N)C(=O)NCC(N)=O
: