Target
Prothrombin
Ligand
BDBM50147821
Substrate
Meas. Tech.
ChEMBL_208532 (CHEMBL813626)
Ki
0.096±n/a nM
Citation
 Young, MBBarrow, JCGlass, KLLundell, GFNewton, CLPellicore, JMRittle, KESelnick, HGStauffer, KJVacca, JPWilliams, PDBohn, DClayton, FCCook, JJKrueger, JAKuo, LCLewis, SDLucas, BJMcMasters, DRMiller-Stein, CPietrak, BLWallace, AAWhite, RBWong, BYan, YNantermet, PG Discovery and evaluation of potent P1 aryl heterocycle-based thrombin inhibitors. J Med Chem 47:2995-3008 (2004)  
Target
Name:
Prothrombin
Synonyms:
Activation peptide fragment 1 Coagulation factor II Prothrombin precursor Thrombin heavy chain | Thrombin light chain
Type:
Protein
Mol. Mass.:
70029.57
Organism:
Homo sapiens (Human)
Description:
P00734
Residue:
622
  
Inhibitor
Name:
BDBM50147821
Synonyms:
2-[6-Chloro-3-(2,2-difluoro-2-pyridin-2-yl-ethylamino)-2-oxo-2H-pyrazin-1-yl]-N-(2-tetrazol-1-yl-benzyl)-acetamide | CHEMBL103738
Type:
Small organic molecule
Emp. Form.:
C21H18ClF2N9O2
Mol. Mass.:
501.877
SMILES:
FC(F)(CNc1ncc(Cl)n(CC(=O)NCc2ccccc2-n2cnnn2)c1=O)c1ccccn1
: