Target
Transporter
Ligand
BDBM50147840
Substrate
Meas. Tech.
ChEMBL_143105 (CHEMBL749355)
Ki
31±n/a nM
Citation
 Petukhov, PAZhang, JWang, CZYe, YPJohnson, KMKozikowski, AP Synthesis, molecular modeling, and biological studies of novel piperidine-based analogues of cocaine: evidence of unfavorable interactions proximal to the 3alpha-position of the piperidine ring. J Med Chem 47:3009-18 (2004)  
Target
Name:
Transporter
Synonyms:
Monoamine transporters; Norepininephrine & dopamine | Norepinephrine Monoamine transporters
Type:
PROTEIN
Mol. Mass.:
66787.87
Organism:
Rattus norvegicus
Description:
ChEMBL_1463061
Residue:
597
  
Inhibitor
Name:
BDBM50147840
Synonyms:
3-[(3R,4S)-4-(4-Chloro-phenyl)-1-methyl-piperidin-3-yl]-propionic acid methyl ester | CHEMBL103290
Type:
Small organic molecule
Emp. Form.:
C16H22ClNO2
Mol. Mass.:
295.804
SMILES:
COC(=O)CC[C@H]1CN(C)CC[C@@H]1c1ccc(Cl)cc1
: