Target
S-methyl-5'-thioadenosine phosphorylase
Ligand
BDBM36495
Substrate
Meas. Tech.
ChEMBL_238 (CHEMBL615270)
Ki
26±n/a nM
Citation
 Evans, GBFurneaux, RHSchramm, VLSingh, VTyler, PC Targeting the polyamine pathway with transition-state analogue inhibitors of 5'-methylthioadenosine phosphorylase. J Med Chem 47:3275-81 (2004)  
Target
Name:
S-methyl-5'-thioadenosine phosphorylase
Synonyms:
5'-Methylthioadenosine phosphorylase (MTAP) MTA phosphorylase MTAP_HUMAN Methylthioadenosine Phosphorylase (MTAP) | S-methyl-5 -thioadenosine phosphorylase
Type:
Enzyme
Mol. Mass.:
31239.23
Organism:
Homo sapiens (Human)
Description:
Residue:
283
  
Inhibitor
Name:
BDBM36495
Synonyms:
CHEMBL554642 | ImmA-Bn
Type:
Small organic moelcule
Emp. Form.:
C18H21N5O2S
Mol. Mass.:
371.457
SMILES:
Nc1ncnc2c(c[nH]c12)C1NC(CSCc2ccccc2)C(O)C1O
: