Target
Vasopressin V2 receptor
Ligand
BDBM50370398
Substrate
Meas. Tech.
ChEMBL_215012 (CHEMBL818810)
IC50
200±n/a nM
Citation
 Itzhak, YKalir, AWeissman, BACohen, S New analgesic drugs derived from phencyclidine. J Med Chem 24:496-9 (1981)  
Target
Name:
Vasopressin V2 receptor
Synonyms:
AVPR V2 Avpr2 V2R_RAT Vasopressin receptor
Type:
G-protein coupled receptor
Mol. Mass.:
40761.85
Organism:
Rattus norvegicus (Rat)
Description:
Residue:
371
  
Inhibitor
Name:
BDBM50370398
Synonyms:
CHEMBL175211
Type:
Small organic molecule
Emp. Form.:
C28H25N3O2
Mol. Mass.:
435.517
SMILES:
O=C(Nc1ccc(cc1)C(=O)N1CCCCc2[nH]ccc12)c1ccccc1-c1ccccc1
: