Target
Vasopressin V2 receptor
Ligand
BDBM50370400
Substrate
Meas. Tech.
ChEMBL_214715 (CHEMBL815213)
IC50
60±n/a nM
Citation
 Itzhak, YKalir, AWeissman, BACohen, S New analgesic drugs derived from phencyclidine. J Med Chem 24:496-9 (1981)  
Target
Name:
Vasopressin V2 receptor
Synonyms:
ADHR AVPR2 DIR Renal-type arginine vasopressin receptor V2R_HUMAN Vasopressin V2 receptor | Vasopressin receptor
Type:
Receptor
Mol. Mass.:
40295.28
Organism:
Homo sapiens (Human)
Description:
P30518
Residue:
371
  
Inhibitor
Name:
BDBM50370400
Synonyms:
CHEMBL176264
Type:
Small organic molecule
Emp. Form.:
C29H27N3O2
Mol. Mass.:
449.5436
SMILES:
Cn1ccc2N(CCCCc12)C(=O)c1ccc(NC(=O)c2ccccc2-c2ccccc2)cc1
: