Target
Nitric oxide synthase, endothelial
Ligand
BDBM50081082
Substrate
Meas. Tech.
ChEMBL_305434 (CHEMBL877002)
IC50
887±n/a nM
Citation
 Nason, DMHeck, SDBodenstein, MSLowe, JANelson, RBListon, DRNolan, CELanyon, LFWard, KMVolkmann, RA Substituted 6-phenyl-pyridin-2-ylamines: selective and potent inhibitors of neuronal nitric oxide synthase. Bioorg Med Chem Lett 14:4511-4 (2004)  
Target
Name:
Nitric oxide synthase, endothelial
Synonyms:
Constitutive NOS Endothelial NOS NOS type III NOS3_HUMAN Nitric oxide synthase (inducible and endothelial) Nitric-oxide synthase (endothelial and brain) eNOS
Type:
Enzyme Catalytic Domain
Mol. Mass.:
133297.84
Organism:
Homo sapiens (Human)
Description:
P29474
Residue:
1203
  
Inhibitor
Name:
BDBM50081082
Synonyms:
2-(4-{2-[4-(6-Amino-pyridin-2-yl)-phenyl]-ethyl}-piperazin-1-yl)-1-phenyl-ethanone | CHEMBL40391
Type:
Small organic molecule
Emp. Form.:
C25H28N4O
Mol. Mass.:
400.516
SMILES:
Nc1cccc(n1)-c1ccc(CCN2CCN(CC(=O)c3ccccc3)CC2)cc1
: