Target
Nitric oxide synthase, endothelial
Ligand
BDBM50150913
Substrate
Meas. Tech.
ChEMBL_305165 (CHEMBL832755)
IC50
>50000±n/a nM
Citation
 Shankaran, KDonnelly, KLShah, SKGuthikonda, RNMacCoss, MHumes, JLPacholok, SGGrant, SKKelly, TMWong, KK Evaluation of pyrrolidin-2-imines and 1,3-thiazolidin-2-imines as inhibitors of nitric oxide synthase. Bioorg Med Chem Lett 14:4539-44 (2004)  
Target
Name:
Nitric oxide synthase, endothelial
Synonyms:
Constitutive NOS Endothelial NOS NOS type III NOS3_HUMAN Nitric oxide synthase (inducible and endothelial) Nitric-oxide synthase (endothelial and brain) eNOS
Type:
Enzyme Catalytic Domain
Mol. Mass.:
133297.84
Organism:
Homo sapiens (Human)
Description:
P29474
Residue:
1203
  
Inhibitor
Name:
BDBM50150913
Synonyms:
5-Methyl-thiazolidin-(2E)-ylideneamine | CHEMBL185505
Type:
Small organic molecule
Emp. Form.:
C4H8N2S
Mol. Mass.:
116.185
SMILES:
CC1CN=C(N)S1
: