Target
Beta-2 adrenergic receptor
Ligand
BDBM50151722
Substrate
Meas. Tech.
ChEMBL_302767 (CHEMBL876356)
Ki
35±n/a nM
Citation
 Alikhani, VBeer, DBentley, DBruce, ICuenoud, BMFairhurst, RAGedeck, PHaberthuer, SHayden, CJanus, DJordan, LLewis, CSmithies, KWissler, E Long-chain formoterol analogues: an investigation into the effect of increasing amino-substituent chain length on the beta2-adrenoceptor activity. Bioorg Med Chem Lett 14:4705-10 (2004)  
Target
Name:
Beta-2 adrenergic receptor
Synonyms:
ADRB2 ADRB2_HUMAN Beta-2 adrenoceptor | Beta-2 adrenoreceptor
Type:
Mol. Mass.:
46461.69
Organism:
Homo sapiens (Human)
Description:
P07550
Residue:
413
  
Inhibitor
Name:
BDBM50151722
Synonyms:
CHEMBL185262 | N-(2-Hydroxy-5-{1-hydroxy-2-[2-(4-phenoxy-phenyl)-ethylamino]-ethyl}-phenyl)-formamide
Type:
Small organic molecule
Emp. Form.:
C23H24N2O4
Mol. Mass.:
392.4477
SMILES:
O[C@@H](CNCCc1ccc(Oc2ccccc2)cc1)c1ccc(O)c(NC=O)c1
: