Target
Beta-2 adrenergic receptor
Ligand
BDBM50151724
Substrate
Meas. Tech.
ChEMBL_302767 (CHEMBL876356)
Ki
3.3±n/a nM
Citation
 Alikhani, VBeer, DBentley, DBruce, ICuenoud, BMFairhurst, RAGedeck, PHaberthuer, SHayden, CJanus, DJordan, LLewis, CSmithies, KWissler, E Long-chain formoterol analogues: an investigation into the effect of increasing amino-substituent chain length on the beta2-adrenoceptor activity. Bioorg Med Chem Lett 14:4705-10 (2004)  
Target
Name:
Beta-2 adrenergic receptor
Synonyms:
ADRB2 ADRB2_HUMAN Beta-2 adrenoceptor | Beta-2 adrenoreceptor
Type:
Mol. Mass.:
46461.69
Organism:
Homo sapiens (Human)
Description:
P07550
Residue:
413
  
Inhibitor
Name:
BDBM50151724
Synonyms:
CHEMBL183948 | N-[2-Hydroxy-5-(1-hydroxy-2-{2-[3-(3-phenoxy-propoxy)-phenyl]-ethylamino}-ethyl)-phenyl]-formamide
Type:
Small organic molecule
Emp. Form.:
C26H30N2O5
Mol. Mass.:
450.5268
SMILES:
O[C@@H](CNCCc1cccc(OCCCOc2ccccc2)c1)c1ccc(O)c(NC=O)c1
: