Target
Protein kinase C beta type
Ligand
BDBM50153465
Substrate
Meas. Tech.
ChEMBL_305557 (CHEMBL828576)
IC50
2±n/a nM
Citation
 Tanaka, MSagawa, SHoshi, JShimoma, FMatsuda, ISakoda, KSasase, TShindo, MInaba, T Synthesis of anilino-monoindolylmaleimides as potent and selective PKCbeta inhibitors. Bioorg Med Chem Lett 14:5171-4 (2004)  
Target
Name:
Protein kinase C beta type
Synonyms:
KPCB_HUMAN PKC beta PKCB PRKCB1 Protein kinase C beta type | Protein kinase C beta type II (PRKCB2)
Type:
Enzyme
Mol. Mass.:
76873.67
Organism:
Homo sapiens (Human)
Description:
The recombinant human PKC enzymes were produced using a baculovirus expression system in SF9 cells
Residue:
671
  
Inhibitor
Name:
BDBM50153465
Synonyms:
2-{3-[3-(2,5-Dioxo-4-phenylamino-2,5-dihydro-1H-pyrrol-3-yl)-indol-1-yl]-propyl}-isothiourea; hydrobromide | CHEMBL540357
Type:
Small organic molecule
Emp. Form.:
C22H21N5O2S
Mol. Mass.:
419.499
SMILES:
NC(=N)SCCCn1cc(C2=C(Nc3ccccc3)C(=O)NC2=O)c2ccccc12
: