Target
Alpha-2A/Alpha-2B/Alpha-2C adrenergic receptor
Ligand
BDBM50181836
Substrate
Meas. Tech.
ChEMBL_305672 (CHEMBL827941)
IC50
>10000±n/a nM
Citation
 Becker, DPFlynn, DLShone, RLGullikson, G Azaadamantane benzamide 5-HT4 agonists: gastrointestinal prokinetic SC-54750. Bioorg Med Chem Lett 14:5509-12 (2004)  
Target
Name:
Alpha-2A/Alpha-2B/Alpha-2C adrenergic receptor
Synonyms:
Adrenergic Receptors (alpha 2) | Adrenergic receptor alpha-2
Type:
Mol. Mass.:
Description:
ASSAY_ID of ChEMBL is 305672
Components:
This complex has 3 components.
Component 1
Name:
Alpha-2B adrenergic receptor
Synonyms:
ADA2B_HUMAN ADRA2L1 Adrenergic alpha2B Adrenergic receptor alpha Alpha-2 adrenergic receptor subtype C2 Alpha-2B adrenoreceptor | Alpha-2BAR
Type:
Enzyme
Mol. Mass.:
49964.20
Organism:
Homo sapiens (Human)
Description:
P18089
Residue:
450
  
Component 2
Name:
Alpha-2A adrenergic receptor
Synonyms:
ADA2A_HUMAN ADRA2R Adrenergic alpha2A Alpha-2 adrenergic receptor subtype C10 Alpha-2A adrenoreceptor alpha-2A adrenergic receptor [Homo sapiens]
Type:
Enzyme
Mol. Mass.:
48979.91
Organism:
Homo sapiens (Human)
Description:
P08913
Residue:
450
  
Component 3
Name:
Alpha-2C adrenergic receptor
Synonyms:
ADA2C_HUMAN ADRA2L2 Adrenergic alpha2C Adrenergic receptor alpha Alpha-2 adrenergic receptor subtype C4 Alpha-2C adrenoreceptor | adrenergic, alpha-2C-, receptor [Homo sapiens]
Type:
Enzyme
Mol. Mass.:
49552.32
Organism:
Homo sapiens (Human)
Description:
P18825
Residue:
462
  
Inhibitor
Name:
BDBM50181836
Synonyms:
4-Amino-N-(1-aza-tricyclo[3.3.1.0*3,7*]non-4-yl)-5-chloro-2-methoxy-benzamide 4-Amino-N-(1R,3S,4R,7R)-1-aza-tricyclo[3.3.1.0*3,7*]non-4-yl-5-chloro-2-methoxy-benzamide BDBM50449569 CHEMBL319673 | SC-52491
Type:
Small organic molecule
Emp. Form.:
C16H20ClN3O2
Mol. Mass.:
321.802
SMILES:
COc1cc(N)c(Cl)cc1C(=O)N[C@@H]1C2CC3CN(CC13)C2
: