Target
Alpha-1A/Alpha-1B/Alpha-1D adrenergic receptor
Ligand
BDBM50181836
Substrate
Meas. Tech.
ChEMBL_306566 (CHEMBL829141)
IC50
>10000±n/a nM
Citation
 Becker, DPFlynn, DLShone, RLGullikson, G Azaadamantane benzamide 5-HT4 agonists: gastrointestinal prokinetic SC-54750. Bioorg Med Chem Lett 14:5509-12 (2004)  
Target
Name:
Alpha-1A/Alpha-1B/Alpha-1D adrenergic receptor
Synonyms:
Adrenergic receptor alpha-1
Type:
Mol. Mass.:
Description:
ASSAY_ID of ChEMBL is 306566
Components:
This complex has 3 components.
Component 1
Name:
Alpha-1D adrenergic receptor
Synonyms:
ADA1D_HUMAN ADRA1D Adrenergic receptor alpha Alpha 1D-adrenoreceptor Alpha-1D adrenoceptor adrenergic Alpha1D
Type:
Enzyme Catalytic Domain
Mol. Mass.:
60485.82
Organism:
Homo sapiens (Human)
Description:
adrenergic Alpha1D ADRA1D HUMAN::P25100
Residue:
572
  
Component 2
Name:
Alpha-1B adrenergic receptor
Synonyms:
ADA1B_HUMAN Adrenergic alpha1B Adrenergic receptor alpha Alpha 1B-adrenoreceptor | Alpha-1B adrenergic receptor
Type:
Enzyme
Mol. Mass.:
56862.13
Organism:
Homo sapiens (Human)
Description:
P35368
Residue:
520
  
Component 3
Name:
Alpha-1A adrenergic receptor
Synonyms:
ADA1A_HUMAN ADRA1C Alpha 1A-adrenoceptor Alpha adrenergic receptor 1a Alpha-adrenergic receptor 1c adrenergic Alpha1 | adrenergic Alpha1C
Type:
Cell-surface receptors
Mol. Mass.:
51511.67
Organism:
Homo sapiens (Human)
Description:
P35348
Residue:
466
  
Inhibitor
Name:
BDBM50181836
Synonyms:
4-Amino-N-(1-aza-tricyclo[3.3.1.0*3,7*]non-4-yl)-5-chloro-2-methoxy-benzamide 4-Amino-N-(1R,3S,4R,7R)-1-aza-tricyclo[3.3.1.0*3,7*]non-4-yl-5-chloro-2-methoxy-benzamide BDBM50449569 CHEMBL319673 | SC-52491
Type:
Small organic molecule
Emp. Form.:
C16H20ClN3O2
Mol. Mass.:
321.802
SMILES:
COc1cc(N)c(Cl)cc1C(=O)N[C@@H]1C2CC3CN(CC13)C2
: