Target
Carbonic anhydrase 2
Ligand
BDBM50155547
Substrate
Meas. Tech.
ChEMBL_302866 (CHEMBL828781)
Ki
0.6±n/a nM
Citation
 Cecchi, AWinum, JYInnocenti, AVullo, DMontero, JLScozzafava, ASupuran, CT Carbonic anhydrase inhibitors: synthesis and inhibition of cytosolic/tumor-associated carbonic anhydrase isozymes I, II, and IX with sulfonamides derived from 4-isothiocyanato-benzolamide. Bioorg Med Chem Lett 14:5775-80 (2004)  
Target
Name:
Carbonic anhydrase 2
Synonyms:
CA-II CAC Carbonate dehydratase II Carbonic anhydrase 2 (CA-II) Carbonic anhydrase C Carbonic anhydrase II (CA-II) Carbonic anhydrase II (hCA II) | Carbonic anhydrase isoenzyme II (hCA II)
Type:
Enzyme
Mol. Mass.:
29250.71
Organism:
Homo sapiens (Human)
Description:
P00918
Residue:
260
  
Inhibitor
Name:
BDBM50155547
Synonyms:
5-(4-{3-[1,2-Dihydroxy-2-(4-nitro-phenyl)-ethyl]-thioureido}-benzenesulfonylamino)-[1,3,4]thiadiazole-2-sulfonic acid amide | CHEMBL185170
Type:
Small organic molecule
Emp. Form.:
C17H17N7O8S4
Mol. Mass.:
575.619
SMILES:
NS(=O)(=O)c1nnc(NS(=O)(=O)c2ccc(NC(=[SH+])[N-]C(O)C(O)c3ccc(cc3)[N+]([O-])=O)cc2)s1
: