Target
Carbonic anhydrase 2
Ligand
BDBM50155540
Substrate
Meas. Tech.
ChEMBL_302866 (CHEMBL828781)
Ki
0.9±n/a nM
Citation
 Cecchi, AWinum, JYInnocenti, AVullo, DMontero, JLScozzafava, ASupuran, CT Carbonic anhydrase inhibitors: synthesis and inhibition of cytosolic/tumor-associated carbonic anhydrase isozymes I, II, and IX with sulfonamides derived from 4-isothiocyanato-benzolamide. Bioorg Med Chem Lett 14:5775-80 (2004)  
Target
Name:
Carbonic anhydrase 2
Synonyms:
CA-II CAC Carbonate dehydratase II Carbonic anhydrase 2 (CA-II) Carbonic anhydrase C Carbonic anhydrase II (CA-II) Carbonic anhydrase II (hCA II) | Carbonic anhydrase isoenzyme II (hCA II)
Type:
Enzyme
Mol. Mass.:
29250.71
Organism:
Homo sapiens (Human)
Description:
P00918
Residue:
260
  
Inhibitor
Name:
BDBM50155540
Synonyms:
5-{4-[3-(2-Piperazin-1-yl-ethyl)-thioureido]-benzenesulfonylamino}-[1,3,4]thiadiazole-2-sulfonic acid amide | CHEMBL187372
Type:
Small organic molecule
Emp. Form.:
C15H22N8O4S4
Mol. Mass.:
506.646
SMILES:
NS(=O)(=O)c1nnc(NS(=O)(=O)c2ccc(NC(=S)NCCN3CCNCC3)cc2)s1
: