Target
Putative alpha-glucosidase
Ligand
BDBM50156355
Substrate
Meas. Tech.
ChEMBL_304940 (CHEMBL826969)
IC50
11000±n/a nM
Citation
 Godin, GCompain, PMartin, ORIkeda, KYu, LAsano, N Alpha-1-C-alkyl-1-deoxynojirimycin derivatives as potent and selective inhibitors of intestinal isomaltase: remarkable effect of the alkyl chain length on glycosidase inhibitory profile. Bioorg Med Chem Lett 14:5991-5 (2004)  
Target
Name:
Putative alpha-glucosidase
Synonyms:
Alpha-glucosidase
Type:
PROTEIN
Mol. Mass.:
102549.55
Organism:
Oryza sativa subsp. japonica
Description:
ChEMBL_304920
Residue:
929
  
Inhibitor
Name:
BDBM50156355
Synonyms:
2-Butyl-6-hydroxymethyl-piperidine-3,4,5-triol | CHEMBL365496
Type:
Small organic molecule
Emp. Form.:
C10H21NO4
Mol. Mass.:
219.278
SMILES:
CCCCC1NC(CO)C(O)C(O)C1O
: