Target
Putative alpha-glucosidase
Ligand
BDBM50156360
Substrate
Meas. Tech.
ChEMBL_304940 (CHEMBL826969)
IC50
1500±n/a nM
Citation
 Godin, GCompain, PMartin, ORIkeda, KYu, LAsano, N Alpha-1-C-alkyl-1-deoxynojirimycin derivatives as potent and selective inhibitors of intestinal isomaltase: remarkable effect of the alkyl chain length on glycosidase inhibitory profile. Bioorg Med Chem Lett 14:5991-5 (2004)  
Target
Name:
Putative alpha-glucosidase
Synonyms:
Alpha-glucosidase
Type:
PROTEIN
Mol. Mass.:
102549.55
Organism:
Oryza sativa subsp. japonica
Description:
ChEMBL_304920
Residue:
929
  
Inhibitor
Name:
BDBM50156360
Synonyms:
2-Hydroxymethyl-6-nonyl-piperidine-3,4,5-triol | CHEMBL184028
Type:
Small organic molecule
Emp. Form.:
C15H31NO4
Mol. Mass.:
289.4109
SMILES:
CCCCCCCCCC1NC(CO)C(O)C(O)C1O
: