Target
Sucrase-isomaltase, intestinal
Ligand
BDBM50156360
Substrate
Meas. Tech.
ChEMBL_305897 (CHEMBL832911)
IC50
3.5±n/a nM
Citation
 Godin, GCompain, PMartin, ORIkeda, KYu, LAsano, N Alpha-1-C-alkyl-1-deoxynojirimycin derivatives as potent and selective inhibitors of intestinal isomaltase: remarkable effect of the alkyl chain length on glycosidase inhibitory profile. Bioorg Med Chem Lett 14:5991-5 (2004)  
Target
Name:
Sucrase-isomaltase, intestinal
Synonyms:
SUIS_RAT Sucrase-isomaltase | alpha-Glucosidase (α-Glucosidase)
Type:
Enzyme
Mol. Mass.:
210329.04
Organism:
Rattus norvegicus (Rat)
Description:
P23739
Residue:
1841
  
Inhibitor
Name:
BDBM50156360
Synonyms:
2-Hydroxymethyl-6-nonyl-piperidine-3,4,5-triol | CHEMBL184028
Type:
Small organic molecule
Emp. Form.:
C15H31NO4
Mol. Mass.:
289.4109
SMILES:
CCCCCCCCCC1NC(CO)C(O)C(O)C1O
: