Target
Prothrombin
Ligand
BDBM50292195
Substrate
Meas. Tech.
ChEMBL_302401 (CHEMBL829646)
Ki
0.4±n/a nM
Citation
 Nantermet, PGBurgey, CSRobinson, KAPellicore, JMNewton, CLDeng, JZSelnick, HGLewis, SDLucas, BJKrueger, JAMiller-Stein, CWhite, RBWong, BMcMasters, DRWallace, AALynch, JJYan, YChen, ZKuo, LGardell, SJShafer, JAVacca, JPLyle, TA P2 pyridine N-oxide thrombin inhibitors: a novel peptidomimetic scaffold. Bioorg Med Chem Lett 15:2771-5 (2005)  
Target
Name:
Prothrombin
Synonyms:
Activation peptide fragment 1 Coagulation factor II Prothrombin precursor Thrombin heavy chain | Thrombin light chain
Type:
Protein
Mol. Mass.:
70029.57
Organism:
Homo sapiens (Human)
Description:
P00734
Residue:
622
  
Inhibitor
Name:
BDBM50292195
Synonyms:
CHEMBL373270 | N-(2-Aminomethyl-benzyl)-2-[3-chloro-6-(2,2-difluoro-2-pyridin-2-yl-ethylamino)-1-oxy-pyridin-2-yl]-acetamide
Type:
Small organic molecule
Emp. Form.:
C22H22ClF2N5O2
Mol. Mass.:
461.892
SMILES:
NCc1ccccc1CNC(=O)Cc1c(Cl)ccc(NCC(F)(F)c2ccccn2)[n+]1[O-]
: