Target
Oxysterols receptor LXR-beta
Ligand
BDBM50167698
Substrate
Meas. Tech.
ChEMBL_304242 (CHEMBL841797)
EC50
1±n/a nM
Citation
 Singh, SBOndeyka, JGLiu, WChen, SChen, TSLi, XBouffard, ADropinski, JJones, ABMcCormick, SHayes, NWang, JSharma, NMacnaul, KHernandez, MChao, YSBaffic, JLam, MHBurton, CSparrow, CPMenke, JG Discovery and development of dimeric podocarpic acid leads as potent agonists of liver X receptor with HDL cholesterol raising activity in mice and hamsters. Bioorg Med Chem Lett 15:2824-8 (2005)  
Target
Name:
Oxysterols receptor LXR-beta
Synonyms:
LXRB Liver X, LXR beta NR1H2 Nuclear receptor NER Ubiquitously-expressed nuclear receptor
Type:
Enzyme Catalytic Domain
Mol. Mass.:
50978.79
Organism:
Homo sapiens (Human)
Description:
P55055
Residue:
460
  
Inhibitor
Name:
BDBM50167698
Synonyms:
13-hydroxy-2,6-dimethyl-(2S,7R)-tricyclo[8.4.0.02,7]tetradeca-1(10),11,13-triene-6-carboxylic 13-hydroxy-2,6-dimethyltricyclo[8.4.0.02,7]tetradeca-1(10),11,13-triene-6-carboxylic anhydride | CHEMBL555373
Type:
Small organic molecule
Emp. Form.:
C34H42O5
Mol. Mass.:
530.6943
SMILES:
CC1(CCCC2(C)C1CCc1ccc(O)cc21)C(=O)OC(=O)C1(C)CCC[C@@]2(C)[C@H]1CCc1ccc(O)cc21
: