Target
Oxysterols receptor LXR-beta
Ligand
BDBM50167700
Substrate
Meas. Tech.
ChEMBL_306648 (CHEMBL832985)
IC50
12±n/a nM
Citation
 Singh, SBOndeyka, JGLiu, WChen, SChen, TSLi, XBouffard, ADropinski, JJones, ABMcCormick, SHayes, NWang, JSharma, NMacnaul, KHernandez, MChao, YSBaffic, JLam, MHBurton, CSparrow, CPMenke, JG Discovery and development of dimeric podocarpic acid leads as potent agonists of liver X receptor with HDL cholesterol raising activity in mice and hamsters. Bioorg Med Chem Lett 15:2824-8 (2005)  
Target
Name:
Oxysterols receptor LXR-beta
Synonyms:
LXRB Liver X, LXR beta NR1H2 Nuclear receptor NER Ubiquitously-expressed nuclear receptor
Type:
Enzyme Catalytic Domain
Mol. Mass.:
50978.79
Organism:
Homo sapiens (Human)
Description:
P55055
Residue:
460
  
Inhibitor
Name:
BDBM50167700
Synonyms:
(1S,4aS,10aR)-6-Hydroxy-1,4a-dimethyl-1,2,3,4,4a,9,10,10a-octahydro-phenanthrene-1-carboxylic acid (4aR,9S)-6-hydroxy-1,4a-dimethyl-1,2,3,4,4a,9,10,10a-octahydro-phenanthren-1-ylmethyl ester | CHEMBL195184
Type:
Small organic molecule
Emp. Form.:
C34H44O4
Mol. Mass.:
516.7108
SMILES:
CC1(COC(=O)[C@@]2(C)CCC[C@@]3(C)[C@H]2CCc2ccc(O)cc32)CCC[C@@]2(C)[C@H]1CCc1ccc(O)cc21
: