Target
Adenosine receptor A1
Ligand
BDBM50166739
Substrate
Meas. Tech.
ChEMBL_303729 (CHEMBL829635)
Ki
1760±n/a nM
Citation
 Press, NJTaylor, RJFullerton, JDTranter, PMcCarthy, CKeller, THBrown, LCheung, RChristie, JHaberthuer, SHatto, JDKeenan, MMercer, MKPress, NESahri, HTuffnell, ARTweed, MFozard, JR A new orally bioavailable dual adenosine A2B/A3 receptor antagonist with therapeutic potential. Bioorg Med Chem Lett 15:3081-5 (2005)  
Target
Name:
Adenosine receptor A1
Synonyms:
A1 adenosine receptor (hA1) AA1R_HUMAN ADORA1 Adenosine A1-receptor Adenosine receptor A1 (hA1) | Adenosine transporter (AdT)
Type:
G Protein-Coupled Receptor (GPCR)
Mol. Mass.:
36520.92
Organism:
Homo sapiens (Human)
Description:
P30542
Residue:
326
  
Inhibitor
Name:
BDBM50166739
Synonyms:
3-[2-(Pyridin-2-ylamino)-5-[1,2,4]triazol-1-yl-thiazol-4-yl]-benzonitrile | CHEMBL195140
Type:
Small organic molecule
Emp. Form.:
C17H11N7S
Mol. Mass.:
345.381
SMILES:
N#Cc1cccc(c1)-c1nc(Nc2ccccn2)sc1-n1cncn1
: