Target
Adenosine receptor A2b
Ligand
BDBM50166743
Substrate
Meas. Tech.
ChEMBL_303806 (CHEMBL829027)
Ki
92±n/a nM
Citation
 Press, NJTaylor, RJFullerton, JDTranter, PMcCarthy, CKeller, THBrown, LCheung, RChristie, JHaberthuer, SHatto, JDKeenan, MMercer, MKPress, NESahri, HTuffnell, ARTweed, MFozard, JR A new orally bioavailable dual adenosine A2B/A3 receptor antagonist with therapeutic potential. Bioorg Med Chem Lett 15:3081-5 (2005)  
Target
Name:
Adenosine receptor A2b
Synonyms:
AA2BR_HUMAN ADORA2B Adenosine receptors A2b | Adenosine receptors; A2a & A2b
Type:
G Protein-Coupled Receptor (GPCR)
Mol. Mass.:
36341.22
Organism:
Homo sapiens (Human)
Description:
Residue:
332
  
Inhibitor
Name:
BDBM50166743
Synonyms:
3-[5-Imidazol-1-yl-2-(pyridin-3-ylamino)-thiazol-4-yl]-benzonitrile | CHEMBL372182
Type:
Small organic molecule
Emp. Form.:
C18H12N6S
Mol. Mass.:
344.393
SMILES:
N#Cc1cccc(c1)-c1nc(Nc2cccnc2)sc1-n1ccnc1
: