Target
Prostacyclin receptor
Ligand
BDBM23954
Substrate
Meas. Tech.
ChEMBL_302783 (CHEMBL839468)
Ki
6.5±n/a nM
Citation
 Hattori, KOkitsu, OTabuchi, STaniguchi, KNishio, MKoyama, SSeki, JSakane, K Discovery of new diphenyloxazole derivatives containing a pyrrolidine ring: orally active prostacyclin mimetics. Part 2. Bioorg Med Chem Lett 15:3279-83 (2005)  
Target
Name:
Prostacyclin receptor
Synonyms:
PGI receptor PRIPR Prostacyclin (IP) Receptor Prostaglandin I Prostaglandin I2 receptor | Prostanoid IP receptor
Type:
G Protein-Coupled Receptor (GPCR)
Mol. Mass.:
40968.22
Organism:
Homo sapiens (Human)
Description:
The membranes prepared from human platelet were used in binding assay.
Residue:
386
  
Inhibitor
Name:
BDBM23954
Synonyms:
5-[(2E,3aS,4R,5R,6aS)-5-hydroxy-4-[(1E,3S)-3-hydroxy-4-methyloct-1-en-6-yn-1-yl]-octahydropentalen-2-ylidene]pentanoic acid ILOPROST [3H]-Iloprost
Type:
radiolabeled ligand
Emp. Form.:
C22H32O4
Mol. Mass.:
360.4871
SMILES:
[H][C@]12C[C@@H](O)[C@H](\C=C\[C@@H](O)C(C)CC#CC)[C@@]1([H])C\C(C2)=C\CCCC(O)=O
: