Target
Carbonic anhydrase 2
Ligand
BDBM10883
Substrate
Meas. Tech.
ChEMBL_302394 (CHEMBL829640)
Ki
38±n/a nM
Citation
 Vullo, DInnocenti, ANishimori, IPastorek, JScozzafava, APastoreková, SSupuran, CT Carbonic anhydrase inhibitors. Inhibition of the transmembrane isozyme XII with sulfonamides-a new target for the design of antitumor and antiglaucoma drugs? Bioorg Med Chem Lett 15:963-9 (2005)  
Target
Name:
Carbonic anhydrase 2
Synonyms:
CA-II CAC Carbonate dehydratase II Carbonic anhydrase 2 (CA-II) Carbonic anhydrase C Carbonic anhydrase II (CA-II) Carbonic anhydrase II (hCA II) | Carbonic anhydrase isoenzyme II (hCA II)
Type:
Enzyme
Mol. Mass.:
29250.71
Organism:
Homo sapiens (Human)
Description:
P00918
Residue:
260
  
Inhibitor
Name:
BDBM10883
Synonyms:
4,5-dichlorobenzene-1,3-disulfonamide Dichlorophenamide Dichlorophenamide, DCP US10172837, Dichlorphenamide | sulfonamide 4
Type:
Small organic molecule
Emp. Form.:
C6H6Cl2N2O4S2
Mol. Mass.:
305.159
SMILES:
NS(=O)(=O)c1cc(Cl)c(Cl)c(c1)S(N)(=O)=O
: