Target
Matrix metalloproteinase-9
Ligand
BDBM50161331
Substrate
Meas. Tech.
ChEMBL_305737 (CHEMBL829409)
IC50
200±n/a nM
Citation
 Rossello, ANuti, ECarelli, POrlandini, EMacchia, MNencetti, SZandomeneghi, MBalzano, FUccello Barretta, GAlbini, ABenelli, RCercignani, GMurphy, GBalsamo, A N-i-Propoxy-N-biphenylsulfonylaminobutylhydroxamic acids as potent and selective inhibitors of MMP-2 and MT1-MMP. Bioorg Med Chem Lett 15:1321-6 (2005)  
Target
Name:
Matrix metalloproteinase-9
Synonyms:
67 kDa matrix metalloproteinase-9 92 kDa gelatinase CLG4B Gelatinase B MMP9 Matrix metalloproteinase 9 (MMP-9) Matrix metalloproteinase-9 (MMP9)
Type:
Enzyme
Mol. Mass.:
78452.28
Organism:
Homo sapiens (Human)
Description:
P14780
Residue:
707
  
Inhibitor
Name:
BDBM50161331
Synonyms:
2-[(Biphenyl-4-sulfonyl)-isopropoxy-amino]-N-hydroxy-acetamide N-hydroxy-2-(N-isopropoxybiphenyl-4-ylsulfonamido)acetamide
Type:
Small organic molecule
Emp. Form.:
C17H20N2O5S
Mol. Mass.:
364.416
SMILES:
CC(C)ON(CC(=O)NO)S(=O)(=O)c1ccc(cc1)-c1ccccc1
: