Target
Neuronal acetylcholine receptor subunit alpha-7
Ligand
BDBM50164953
Substrate
Meas. Tech.
ChEMBL_303552 (CHEMBL828952)
Ki
0.7±n/a nM
Citation
 Mazurov, AKlucik, JMiao, LPhillips, TYSeamans, ASchmitt, JDHauser, TAJohnson, RTMiller, C 2-(Arylmethyl)-3-substituted quinuclidines as selective alpha 7 nicotinic receptor ligands. Bioorg Med Chem Lett 15:2073-7 (2005)  
Target
Name:
Neuronal acetylcholine receptor subunit alpha-7
Synonyms:
ACHA7_RAT Cholinergic, Nicotinic Alpha7 Chrna7 Neuronal acetylcholine receptor (alpha7 nAChR) Neuronal acetylcholine receptor subunit alpha-7 Neuronal acetylcholine receptor subunit alpha-7 (nAChR)
Type:
Enzyme
Mol. Mass.:
56502.44
Organism:
Rattus norvegicus (Rat)
Description:
Q05941
Residue:
502
  
Inhibitor
Name:
BDBM50164953
Synonyms:
5-Pyridin-2-yl-thiophene-2-carboxylic acid ((2R,3R)-2-pyridin-3-ylmethyl-1-aza-bicyclo[2.2.2]oct-3-yl)-amide | CHEMBL365992
Type:
Small organic molecule
Emp. Form.:
C23H24N4OS
Mol. Mass.:
404.528
SMILES:
O=C(N[C@@H]1C2CCN(CC2)[C@@H]1Cc1cccnc1)c1ccc(s1)-c1ccccn1
: