Target
Geranylgeranyl transferase type-1 subunit beta/Protein farnesyltransferase/geranylgeranyltransferase type-1 subunit alpha
Ligand
BDBM50150662
Substrate
Meas. Tech.
ChEMBL_306136 (CHEMBL831371)
IC50
14000±n/a nM
Citation
 El Oualid, FBurm, BELeroy, IMCohen, LHvan Boom, JHvan den Elst, HOverkleeft, HSvan der Marel, GAOverhand, M Design, synthesis, and evaluation of sugar amino acid based inhibitors of protein prenyl transferases PFT and PGGT-1. J Med Chem 47:3920-3 (2004)  
Target
Name:
Geranylgeranyl transferase type-1 subunit beta/Protein farnesyltransferase/geranylgeranyltransferase type-1 subunit alpha
Synonyms:
Geranylgeranyl transferase type I Geranylgeranyl transferase type I beta/Protein farnesyltransferase/geranylgeranyltransferase type I alpha subunit
Type:
Mol. Mass.:
Description:
ASSAY_ID of EBI is 70196
Components:
This complex has 2 components.
Component 1
Name:
Protein farnesyltransferase/geranylgeranyltransferase type-1 subunit alpha
Synonyms:
CAAX farnesyltransferase alpha subunit FNTA_HUMAN FTase-alpha Geranylgeranyl Transferase (GGTase-I) Chain A Protein Farnesyltransferase (PFT) Chain A Protein farnesyltransferase Protein farnesyltransferase/geranylgeranyltransferase type I alpha subunit | Ras proteins prenyltransferase alpha
Type:
Enzyme
Mol. Mass.:
44392.46
Organism:
Homo sapiens (Human)
Description:
Recombinant human FTase.
Residue:
379
  
Component 2
Name:
Geranylgeranyl transferase type-1 subunit beta
Synonyms:
2.5.1.59 Geranylgeranyl transferase type I Geranylgeranyl transferase type I subunit beta PGGT1B Protein farnesyl/geranylgeranyl transferase | Type I protein geranyl-geranyltransferase subunit beta
Type:
Mol. Mass.:
42369.84
Organism:
Homo sapiens (Human)
Description:
Residue:
377
  
Inhibitor
Name:
BDBM50150662
Synonyms:
(S)-2-({(2S,3S,6R)-6-[((R)-2-Amino-3-tert-butyldisulfanyl-propionylamino)-methyl]-3-benzyloxy-tetrahydro-pyran-2-carbonyl}-amino)-4-methyl-pentanoic acid | CHEMBL189409
Type:
Small organic molecule
Emp. Form.:
C27H43N3O6S2
Mol. Mass.:
569.777
SMILES:
CC(C)C[C@H](NC(=O)[C@H]1O[C@@H](CNC(=O)[C@@H](N)CSSC(C)(C)C)CC[C@@H]1OCc1ccccc1)C(O)=O
: